Target
Mitogen-activated protein kinase kinase kinase kinase 1
Ligand
BDBM501029
Substrate
Meas. Tech.
HPK1 Biochemical Enzyme Assay
IC50
<100±n/a nM
Citation
 Kaila, NLinney, IWard, SWishart, GWhittaker, BCote, AGreenwood, JRLeffler, AAlbanese, SKSeverance, DL HPK1 antagonists and uses thereof US Patent  US11548890 Publication Date 1/10/2023 
Target
Name:
Mitogen-activated protein kinase kinase kinase kinase 1
Synonyms:
HPK1 MAP4K1
Type:
PROTEIN
Mol. Mass.:
91316.07
Organism:
Homo sapiens (Human)
Description:
ChEMBL_586597
Residue:
833
  
Inhibitor
Name:
BDBM501029
Synonyms:
7-((6- ((dimethylamino)- methyl)-5- ((3S.4S]-4- fluoro-3- hydroxypiperidin- 1-yl)pyridin-2- yl)amino)-4- (7-fluoroimidazo [1,2-a]pyridin- 3-yl)isoindolin- 1-one US11548890, Compound I-701
Type:
Small organic molecule
Emp. Form.:
C28H29F2N7O2
Mol. Mass.:
533.5724
SMILES:
CN(C)Cc1nc(Nc2ccc(c3CNC(=O)c23)-c2cnc3cc(F)ccn23)ccc1N1CC[C@H](F)[C@@H](O)C1
: