Target
Mitogen-activated protein kinase kinase kinase kinase 1
Ligand
BDBM501110
Substrate
Meas. Tech.
HPK1 Biochemical Enzyme Assay
IC50
<100±n/a nM
Citation
 Kaila, NLinney, IWard, SWishart, GWhittaker, BCote, AGreenwood, JRLeffler, AAlbanese, SKSeverance, DL HPK1 antagonists and uses thereof US Patent  US11548890 Publication Date 1/10/2023 
Target
Name:
Mitogen-activated protein kinase kinase kinase kinase 1
Synonyms:
HPK1 MAP4K1
Type:
PROTEIN
Mol. Mass.:
91316.07
Organism:
Homo sapiens (Human)
Description:
ChEMBL_586597
Residue:
833
  
Inhibitor
Name:
BDBM501110
Synonyms:
7-((6- ((dimethylamino)- methyl)-5- (4-hydroxy-4- (methoxymeth- yl)piperidin-1- yl)pyridin-2- yl)amino)-4-(7- fluoroimidazo [1,2-a]pyridin- 3-yl)isoindolin- 1-one US11078201, Compound I-782 | US11548890, Compound I-782
Type:
Small organic molecule
Emp. Form.:
C30H34FN7O3
Mol. Mass.:
559.6345
SMILES:
COCC1(O)CCN(CC1)c1ccc(Nc2ccc(c3CNC(=O)c23)-c2cnc3cc(F)ccn23)nc1CN(C)C
: