Target
Histone-lysine N-methyltransferase EZH2 [Y641F]
Ligand
BDBM172085
Substrate
Meas. Tech.
PRC2 Enzyme Assays
IC50
0.520±n/a nM
Citation
 Kuntz, KWChesworth, RDuncan, KWKeilhack, HWarholic, NKlaus, CKnutson, SKWigle, TJSeki, MShirotori, SKawano, S Aryl- or heteroaryl-substituted benzene compounds US Patent  US10155002 Publication Date 12/18/2018 
Target
Name:
Histone-lysine N-methyltransferase EZH2 [Y641F]
Synonyms:
EZH2 EZH2_HUMAN KMT6
Type:
Mol. Mass.:
85351.84
Organism:
Homo sapiens (Human)
Description:
Q15910[Y641F]
Residue:
746
  
Inhibitor
Name:
BDBM172085
Synonyms:
US10155002, Compound 91 US9090562, 91
Type:
Small organic molecule
Emp. Form.:
C32H42N4O3
Mol. Mass.:
530.7009
SMILES:
CCNCc1ccc(cc1)-c1cc(N(CC)C2CCOCC2)c(C)c(c1)C(=O)NCc1c(C)cc(C)[nH]c1=O
: