Target
Histone-lysine N-methyltransferase EZH2 [Y641F]
Ligand
BDBM172181
Substrate
Meas. Tech.
PRC2 Enzyme Assays
IC50
1.82±n/a nM
Citation
 Kuntz, KWChesworth, RDuncan, KWKeilhack, HWarholic, NKlaus, CKnutson, SKWigle, TJSeki, MShirotori, SKawano, S Aryl- or heteroaryl-substituted benzene compounds US Patent  US10155002 Publication Date 12/18/2018 
Target
Name:
Histone-lysine N-methyltransferase EZH2 [Y641F]
Synonyms:
EZH2 EZH2_HUMAN KMT6
Type:
Mol. Mass.:
85351.84
Organism:
Homo sapiens (Human)
Description:
Q15910[Y641F]
Residue:
746
  
Inhibitor
Name:
BDBM172181
Synonyms:
US10155002, Compound 189 US9090562, 189
Type:
Small organic molecule
Emp. Form.:
C40H57N7O3
Mol. Mass.:
683.9257
SMILES:
CCCc1cc(C)[nH]c(=O)c1CNC(=O)c1cc(cc(N(CC)C2CCOCC2)c1C)-c1ccc(nc1)N1CCN(CC1)C1CCN(C)CC1
: