Target
Acetylcholinesterase
Ligand
BDBM9401
Substrate
BDBM8959
Meas. Tech.
Enzyme Inhibition Assay
IC50
155±n/a nM
Citation
 Sugimoto, HTsuchiya, YSugumi, HHigurashi, KKaribe, NIimura, YSasaki, AKawakami, YNakamura, TAraki, S Novel piperidine derivatives. Synthesis and anti-acetylcholinesterase activity of 1-benzyl-4-[2-(N-benzoylamino)ethyl]piperidine derivatives. J Med Chem 33:1880-7 (1990)  
Target
Name:
Acetylcholinesterase
Synonyms:
ACES_MOUSE Acetylcholinesterase (mouse AChE) Ache
Type:
Enzyme
Mol. Mass.:
68165.65
Organism:
Mus musculus (mouse)
Description:
Residue:
614
  
Inhibitor
Name:
BDBM9401
Synonyms:
4-{[2-(1-benzylpiperidin-4-yl)ethyl]carbamoyl}-1-oxidopyridin-1-ium hydrochloride | Piperidine Derivative 3q
Type:
Small organic molecule
Emp. Form.:
C20H25N3O2
Mol. Mass.:
339.4314
SMILES:
[O-][n+]1ccc(cc1)C(=O)NCCC1CCN(Cc2ccccc2)CC1
:
Substrate
Name:
BDBM8959
Synonyms:
(2-Mercaptoethyl)trimethylammonium iodide acetate Acetylthiocholine acetylthiocholine chloride | acetylthiocholine iodide
Type:
Small organic molecule
Emp. Form.:
C7H16NOS
Mol. Mass.:
162.272
SMILES:
CC(=O)SCC[N+](C)(C)C
: