Target
Acetylcholinesterase
Ligand
BDBM9404
Substrate
BDBM8959
Meas. Tech.
Enzyme Inhibition Assay
IC50
46000±n/a nM
Citation
 Sugimoto, HTsuchiya, YSugumi, HHigurashi, KKaribe, NIimura, YSasaki, AKawakami, YNakamura, TAraki, S Novel piperidine derivatives. Synthesis and anti-acetylcholinesterase activity of 1-benzyl-4-[2-(N-benzoylamino)ethyl]piperidine derivatives. J Med Chem 33:1880-7 (1990)  
Target
Name:
Acetylcholinesterase
Synonyms:
ACES_MOUSE Acetylcholinesterase (mouse AChE) Ache
Type:
Enzyme
Mol. Mass.:
68165.65
Organism:
Mus musculus (mouse)
Description:
Residue:
614
  
Inhibitor
Name:
BDBM9404
Synonyms:
Piperidine Derivative 12 | benzyl[2-(1-benzylpiperidin-4-yl)ethyl]amine hydrochloride
Type:
Small organic molecule
Emp. Form.:
C21H28N2
Mol. Mass.:
308.4604
SMILES:
C(CC1CCN(Cc2ccccc2)CC1)NCc1ccccc1
:
Substrate
Name:
BDBM8959
Synonyms:
(2-Mercaptoethyl)trimethylammonium iodide acetate Acetylthiocholine acetylthiocholine chloride | acetylthiocholine iodide
Type:
Small organic molecule
Emp. Form.:
C7H16NOS
Mol. Mass.:
162.272
SMILES:
CC(=O)SCC[N+](C)(C)C
: