Target
Acetylcholinesterase
Ligand
BDBM9406
Substrate
BDBM8959
Meas. Tech.
Enzyme Inhibition Assay
IC50
130±n/a nM
Citation
 Sugimoto, HTsuchiya, YSugumi, HHigurashi, KKaribe, NIimura, YSasaki, AKawakami, YNakamura, TAraki, S Novel piperidine derivatives. Synthesis and anti-acetylcholinesterase activity of 1-benzyl-4-[2-(N-benzoylamino)ethyl]piperidine derivatives. J Med Chem 33:1880-7 (1990)  
Target
Name:
Acetylcholinesterase
Synonyms:
ACES_MOUSE Acetylcholinesterase (mouse AChE) Ache
Type:
Enzyme
Mol. Mass.:
68165.65
Organism:
Mus musculus (mouse)
Description:
Residue:
614
  
Inhibitor
Name:
BDBM9406
Synonyms:
CHEMBL57696 Piperidine Derivative 14
Type:
Small organic molecule
Emp. Form.:
C23H30N2O
Mol. Mass.:
350.4971
SMILES:
CCN(CCC1CCN(Cc2ccccc2)CC1)C(=O)c1ccccc1
:
Substrate
Name:
BDBM8959
Synonyms:
(2-Mercaptoethyl)trimethylammonium iodide acetate Acetylthiocholine acetylthiocholine chloride | acetylthiocholine iodide
Type:
Small organic molecule
Emp. Form.:
C7H16NOS
Mol. Mass.:
162.272
SMILES:
CC(=O)SCC[N+](C)(C)C
: