Target
Acetylcholinesterase
Ligand
BDBM9411
Substrate
BDBM8959
Meas. Tech.
Enzyme Inhibition Assay
IC50
0.6±n/a nM
Citation
 Sugimoto, HTsuchiya, YSugumi, HHigurashi, KKaribe, NIimura, YSasaki, AKawakami, YNakamura, TAraki, S Novel piperidine derivatives. Synthesis and anti-acetylcholinesterase activity of 1-benzyl-4-[2-(N-benzoylamino)ethyl]piperidine derivatives. J Med Chem 33:1880-7 (1990)  
Target
Name:
Acetylcholinesterase
Synonyms:
ACES_MOUSE Acetylcholinesterase (mouse AChE) Ache
Type:
Enzyme
Mol. Mass.:
68165.65
Organism:
Mus musculus (mouse)
Description:
Residue:
614
  
Inhibitor
Name:
BDBM9411
Synonyms:
CHEMBL54058 Piperidine Derivative 23
Type:
Small organic molecule
Emp. Form.:
C34H36N2O3S
Mol. Mass.:
552.726
SMILES:
O=C(N(CCC1CCN(Cc2ccccc2)CC1)c1ccccc1)c1ccc(cc1)S(=O)(=O)Cc1ccccc1
:
Substrate
Name:
BDBM8959
Synonyms:
(2-Mercaptoethyl)trimethylammonium iodide acetate Acetylthiocholine acetylthiocholine chloride | acetylthiocholine iodide
Type:
Small organic molecule
Emp. Form.:
C7H16NOS
Mol. Mass.:
162.272
SMILES:
CC(=O)SCC[N+](C)(C)C
: