Target
Voltage-dependent calcium channel gamma-2 subunit
Ligand
BDBM311784
Substrate
Meas. Tech.
Calcium Flux Assay
IC50
0.794±n/a nM
Citation
 Ameriks, MKLaforteza, BNLebold, TPRavula, SSavall, BMShireman, BT Fused azaheterocyclic compounds and their use as AMPA receptor modulators US Patent  US10155769 Publication Date 12/18/2018 
Target
Name:
Voltage-dependent calcium channel gamma-2 subunit
Synonyms:
CACNG2 Neuronal voltage-gated calcium channel gamma-2 subunit Transmembrane AMPAR regulatory protein gamma-2
Type:
Enzyme Catalytic Domain
Mol. Mass.:
35977.54
Organism:
Homo sapiens (Human)
Description:
Residue:
323
  
Inhibitor
Name:
BDBM311784
Synonyms:
5-(2,7-Bis(trifluoromethyl)-[1,2,4]triazolo[1,5-a]pyridin-8-yl)-7-methylindolin-2-one | US10155769, Example 22
Type:
Small organic molecule
Emp. Form.:
C17H10F6N4O
Mol. Mass.:
400.2779
SMILES:
Cc1cc(cc2CC(=O)Nc12)-c1c(ccn2nc(nc12)C(F)(F)F)C(F)(F)F
: