Target
Voltage-dependent calcium channel gamma-2 subunit
Ligand
BDBM311787
Substrate
Meas. Tech.
Calcium Flux Assay
IC50
0.631±n/a nM
Citation
 Ameriks, MKLaforteza, BNLebold, TPRavula, SSavall, BMShireman, BT Fused azaheterocyclic compounds and their use as AMPA receptor modulators US Patent  US10155769 Publication Date 12/18/2018 
Target
Name:
Voltage-dependent calcium channel gamma-2 subunit
Synonyms:
CACNG2 Neuronal voltage-gated calcium channel gamma-2 subunit Transmembrane AMPAR regulatory protein gamma-2
Type:
Enzyme Catalytic Domain
Mol. Mass.:
35977.54
Organism:
Homo sapiens (Human)
Description:
Residue:
323
  
Inhibitor
Name:
BDBM311787
Synonyms:
7-Chloro-5-(7-(difluoromethyl)-2-(trifluoromethyl)-[1,2,4]triazolo[1,5-a]pyridin-8-yl)indolin-2-one | US10155769, Example 25
Type:
Small organic molecule
Emp. Form.:
C16H8ClF5N4O
Mol. Mass.:
402.706
SMILES:
FC(F)c1ccn2nc(nc2c1-c1cc2CC(=O)Nc2c(Cl)c1)C(F)(F)F
: