Target
Voltage-dependent calcium channel gamma-2 subunit
Ligand
BDBM311804
Substrate
Meas. Tech.
Calcium Flux Assay
IC50
1.000±n/a nM
Citation
 Ameriks, MKLaforteza, BNLebold, TPRavula, SSavall, BMShireman, BT Fused azaheterocyclic compounds and their use as AMPA receptor modulators US Patent  US10155769 Publication Date 12/18/2018 
Target
Name:
Voltage-dependent calcium channel gamma-2 subunit
Synonyms:
CACNG2 Neuronal voltage-gated calcium channel gamma-2 subunit Transmembrane AMPAR regulatory protein gamma-2
Type:
Enzyme Catalytic Domain
Mol. Mass.:
35977.54
Organism:
Homo sapiens (Human)
Description:
Residue:
323
  
Inhibitor
Name:
BDBM311804
Synonyms:
7-(4-Fluorophenyl)-8-(7-fluoro-1H-indazol-5-yl)-2-(trifluoromethyl)-[1,2,4]triazolo[1,5-a]pyridine | US10155769, Example 42
Type:
Small organic molecule
Emp. Form.:
C20H10F5N5
Mol. Mass.:
415.3189
SMILES:
Fc1ccc(cc1)-c1ccn2nc(nc2c1-c1cc(F)c2[nH]ncc2c1)C(F)(F)F
: