Target
Voltage-dependent calcium channel gamma-2 subunit
Ligand
BDBM311824
Substrate
Meas. Tech.
Calcium Flux Assay
IC50
0.316±n/a nM
Citation
 Ameriks, MKLaforteza, BNLebold, TPRavula, SSavall, BMShireman, BT Fused azaheterocyclic compounds and their use as AMPA receptor modulators US Patent  US10155769 Publication Date 12/18/2018 
Target
Name:
Voltage-dependent calcium channel gamma-2 subunit
Synonyms:
CACNG2 Neuronal voltage-gated calcium channel gamma-2 subunit Transmembrane AMPAR regulatory protein gamma-2
Type:
Enzyme Catalytic Domain
Mol. Mass.:
35977.54
Organism:
Homo sapiens (Human)
Description:
Residue:
323
  
Inhibitor
Name:
BDBM311824
Synonyms:
5-(2,7-Bis(trifluoromethyl)imidazo[1,2-a]pyridin-8-yl)-7-methyl-1H-indazole | US10155769, Example 62
Type:
Small organic molecule
Emp. Form.:
C17H10F6N4
Mol. Mass.:
384.2785
SMILES:
Cc1cc(cc2cn[nH]c12)-c1c(ccn2cc(nc12)C(F)(F)F)C(F)(F)F
: