Target
Voltage-dependent calcium channel gamma-2 subunit
Ligand
BDBM311835
Substrate
Meas. Tech.
Calcium Flux Assay
IC50
0.794±n/a nM
Citation
 Ameriks, MKLaforteza, BNLebold, TPRavula, SSavall, BMShireman, BT Fused azaheterocyclic compounds and their use as AMPA receptor modulators US Patent  US10155769 Publication Date 12/18/2018 
Target
Name:
Voltage-dependent calcium channel gamma-2 subunit
Synonyms:
CACNG2 Neuronal voltage-gated calcium channel gamma-2 subunit Transmembrane AMPAR regulatory protein gamma-2
Type:
Enzyme Catalytic Domain
Mol. Mass.:
35977.54
Organism:
Homo sapiens (Human)
Description:
Residue:
323
  
Inhibitor
Name:
BDBM311835
Synonyms:
8-(7-Chloro-1H-indazol-5-yl)-7-ethyl-2-(trifluoromethyl)imidazo[1,2-c]pyrimidine | US10155769, Example 73
Type:
Small organic molecule
Emp. Form.:
C16H11ClF3N5
Mol. Mass.:
365.74
SMILES:
CCc1ncn2cc(nc2c1-c1cc(Cl)c2[nH]ncc2c1)C(F)(F)F
: