Target
Voltage-dependent calcium channel gamma-2 subunit
Ligand
BDBM311848
Substrate
Meas. Tech.
Calcium Flux Assay
IC50
0.025±n/a nM
Citation
 Ameriks, MKLaforteza, BNLebold, TPRavula, SSavall, BMShireman, BT Fused azaheterocyclic compounds and their use as AMPA receptor modulators US Patent  US10155769 Publication Date 12/18/2018 
Target
Name:
Voltage-dependent calcium channel gamma-2 subunit
Synonyms:
CACNG2 Neuronal voltage-gated calcium channel gamma-2 subunit Transmembrane AMPAR regulatory protein gamma-2
Type:
Enzyme Catalytic Domain
Mol. Mass.:
35977.54
Organism:
Homo sapiens (Human)
Description:
Residue:
323
  
Inhibitor
Name:
BDBM311848
Synonyms:
8-(7-Chloro-1H-indazol-5-yl)-2-isopropyl-7-(trifluoromethyl)imidazo[1,2-a]pyridine | US10155769, Example 89
Type:
Small organic molecule
Emp. Form.:
C18H14ClF3N4
Mol. Mass.:
378.779
SMILES:
CC(C)c1cn2ccc(c(-c3cc(Cl)c4[nH]ncc4c3)c2n1)C(F)(F)F
: