Target
Voltage-dependent calcium channel gamma-2 subunit
Ligand
BDBM311852
Substrate
Meas. Tech.
Calcium Flux Assay
IC50
0.501±n/a nM
Citation
 Ameriks, MKLaforteza, BNLebold, TPRavula, SSavall, BMShireman, BT Fused azaheterocyclic compounds and their use as AMPA receptor modulators US Patent  US10155769 Publication Date 12/18/2018 
Target
Name:
Voltage-dependent calcium channel gamma-2 subunit
Synonyms:
CACNG2 Neuronal voltage-gated calcium channel gamma-2 subunit Transmembrane AMPAR regulatory protein gamma-2
Type:
Enzyme Catalytic Domain
Mol. Mass.:
35977.54
Organism:
Homo sapiens (Human)
Description:
Residue:
323
  
Inhibitor
Name:
BDBM311852
Synonyms:
2-(Difluoromethyl)-8-(7-methyl-1H-indazol-5-yl)-7-(trifluoromethyl)imidazo[1,2-a]pyridine | US10155769, Example 93
Type:
Small organic molecule
Emp. Form.:
C17H11F5N4
Mol. Mass.:
366.2881
SMILES:
Cc1cc(cc2cn[nH]c12)-c1c(ccn2cc(nc12)C(F)F)C(F)(F)F
: