Target
Cytochrome P450 11B1, mitochondrial
Ligand
BDBM9921
Substrate
BDBM8582
Meas. Tech.
CYP11B Assay
pH
7.4±n/a
Temperature
310.15±n/a K
IC50
2452±n/a nM
Citation
 Ulmschneider, SNegri, MVoets, MHartmann, RW Development and evaluation of a pharmacophore model for inhibitors of aldosterone synthase (CYP11B2). Bioorg Med Chem Lett 16:25-30 (2006)  
Target
Name:
Cytochrome P450 11B1, mitochondrial
Synonyms:
C11B1_HUMAN CYPXIB1 Cytochrome P450 11B1 Cytochrome P450 11B1, mitochondrial | S11BH
Type:
Enzyme
Mol. Mass.:
57591.44
Organism:
Homo sapiens (Human)
Description:
P15538
Residue:
503
  
Inhibitor
Name:
BDBM9921
Synonyms:
3-(1,2-dihydroacenaphthylen-3-yl)pyridine | acenaphthene derivative A
Type:
Small organic molecule
Emp. Form.:
C17H13N
Mol. Mass.:
231.2918
SMILES:
C1Cc2c(ccc3cccc1c23)-c1cccnc1
:
Substrate
Name:
BDBM8582
Synonyms:
(1S,2R,10S,11S,14S,15S)-14-(2-hydroxyacetyl)-2,15-dimethyltetracyclo[8.7.0.0^{2,7}.0^{11,15}]heptadec-6-en-5-one 21-hydroxypregn-4-ene-3,20-dione [4-14C]-11-deoxycorticosterone | deoxycorticosterone
Type:
Small organic molecule
Emp. Form.:
C21H30O3
Mol. Mass.:
330.4611
SMILES:
[H][C@@]12CC[C@H](C(=O)CO)[C@@]1(C)CC[C@@]1([H])[C@@]2([H])CCC2=CC(=O)CC[C@]12C
: