Target
Caspase-3
Ligand
BDBM10654
Substrate
Caspase Fluorogenic Substrate
Meas. Tech.
Caspase Inhibition Assay
pH
7±n/a
Temperature
310.15±n/a K
IC50
3±n/a nM
Citation
 Becker, JWRotonda, JSoisson, SMAspiotis, RBayly, CFrancoeur, SGallant, MGarcia-Calvo, MGiroux, AGrimm, EHan, YMcKay, DNicholson, DWPeterson, ERenaud, JRoy, SThornberry, NZamboni, R Reducing the peptidyl features of caspase-3 inhibitors: a structural analysis. J Med Chem 47:2466-74 (2004)  
Target
Name:
Caspase-3
Synonyms:
Apopain CASP3 CPP-32 Caspase 3 Caspase-3 subunit p17 SCA-1 Yama protein | caspase-3 preproprotein
Type:
Hydrolase; heterotetramer of two heterodimers
Mol. Mass.:
31607.55
Organism:
Homo sapiens (Human)
Description:
Residue:
277
  
Inhibitor
Name:
BDBM10654
Synonyms:
(3S)-3-[({(2S)-5-[(N-ACETYL-L-ALPHA-ASPARTYL)AMINO]-4-OXO-1,2,4,5,6,7-HEXAHYDROAZEPINO[3,2,1-HI]INDOL-2-YL}CARBONYL)AMINO]-5-(BENZYLSULFANYL)-4-OXOPENTANOIC ACID 5,6,7 TRICYCLIC PEPTIDOMIMETIC INHIBITOR | Compound 4
Type:
Small organic molecule
Emp. Form.:
C31H34N4O9S
Mol. Mass.:
638.688
SMILES:
CC(=O)N[C@@H](CC(O)=O)C(=O)N[C@H]1CCc2cccc3C[C@H](N(c23)C1=O)C(=O)N[C@@H](CC(O)=O)C(=O)CSCc1ccccc1
:
Substrate
Name:
Caspase Fluorogenic Substrate
Synonyms:
Ac-DEVD-AMC | Caspase Fluorogenic Substrate
Type:
Peptide
Mol. Mass.:
1461.77
Organism:
Description:
AMC=7-Amino-4-methylcoumarin
Residue:
16
ACASPGLVALASPAMC