Target
Amine oxidase [flavin-containing] B
Ligand
BDBM10798
Substrate
BDBM10758
Meas. Tech.
Cholinesterase Inhibition Assay
IC50
600±n/a nM
Citation
 Sterling, JHerzig, YGoren, TFinkelstein, NLerner, DGoldenberg, WMiskolczi, IMolnar, SRantal, FTamas, TToth, GZagyva, AZekany, AFinberg, JLavian, GGross, AFriedman, RRazin, MHuang, WKrais, BChorev, MYoudim, MBWeinstock, M Novel dual inhibitors of AChE and MAO derived from hydroxy aminoindan and phenethylamine as potential treatment for Alzheimer's disease. J Med Chem 45:5260-79 (2002)  
Target
Name:
Amine oxidase [flavin-containing] B
Synonyms:
AOFB_RAT Amine oxidase [flavin-containing] B Monoamine Oxidase Type B (MAO-B) Monoamine oxidase B (MAO-B) Monoamine oxidase type B (MAOB) | Monoamine oxidase-B (MAO-B)
Type:
Enzyme
Mol. Mass.:
58469.65
Organism:
Rattus norvegicus (rat)
Description:
P19643
Residue:
520
  
Inhibitor
Name:
BDBM10798
Synonyms:
3-(prop-2-yn-1-ylamino)-2,3-dihydro-1H-inden-5-ol | Aminoindan deriv. 39u
Type:
Small organic molecule
Emp. Form.:
C12H13NO
Mol. Mass.:
187.2377
SMILES:
Oc1ccc2CCC(NCC#C)c2c1
:
Substrate
Name:
BDBM10758
Synonyms:
14C-phenylethylamine CHEMBL610 | phenylethylamine
Type:
Small organic molecule
Emp. Form.:
C8H11N
Mol. Mass.:
121.1796
SMILES:
NCCc1ccccc1
: