Target
Vasopressin V1a receptor
Ligand
BDBM316346
Substrate
Meas. Tech.
Binding Assay
Ki
55±n/a nM
Citation
 Braje, WFroggett, JGeneste, HHornberger, WJantos, KKling, Avan Gaalen, M Fused heterocyclic or carbocyclic compounds carrying a substituted cycloaliphatic radical and use thereof for treating vasopressin-related diseases US Patent  US9617226 Publication Date 4/11/2017 
Target
Name:
Vasopressin V1a receptor
Synonyms:
AVPR V1a AVPR1A V1AR_HUMAN VASOPRESSIN V1A Vasopressin V1 receptor Vasopressin receptor
Type:
Receptor
Mol. Mass.:
46820.18
Organism:
Homo sapiens (Human)
Description:
P37288
Residue:
418
  
Inhibitor
Name:
BDBM316346
Synonyms:
US9617226, Example 27 | cis-2-[2-(3-Chlorophenyl)-4-oxo-6-[3-(1-piperidylmethyl)cyclobutyl]quinazolin-3-yl]-N-cyclopropyl-acetamide
Type:
Small organic molecule
Emp. Form.:
C29H33ClN4O2
Mol. Mass.:
505.051
SMILES:
Clc1cccc(c1)-c1nc2ccc(cc2c(=O)n1CC(=O)NC1CC1)[C@@H]1C[C@H](CN2CCCCC2)C1
: