Target
Vasopressin V1a receptor
Ligand
BDBM316361
Substrate
Meas. Tech.
Binding Assay
Ki
5.5±n/a nM
Citation
 Braje, WFroggett, JGeneste, HHornberger, WJantos, KKling, Avan Gaalen, M Fused heterocyclic or carbocyclic compounds carrying a substituted cycloaliphatic radical and use thereof for treating vasopressin-related diseases US Patent  US9617226 Publication Date 4/11/2017 
Target
Name:
Vasopressin V1a receptor
Synonyms:
AVPR V1a AVPR1A V1AR_HUMAN VASOPRESSIN V1A Vasopressin V1 receptor Vasopressin receptor
Type:
Receptor
Mol. Mass.:
46820.18
Organism:
Homo sapiens (Human)
Description:
P37288
Residue:
418
  
Inhibitor
Name:
BDBM316361
Synonyms:
cis-2-[2-(3-Chlorophenyl)-6-[3-[[(2S,6R)-2,6-dimethylmorpholin-4-yl]methyl]cyclobutyl]-4-oxo-quinazolin-3-yl]-N-isopropyl-acetamide | US9617226, Example 42
Type:
Small organic molecule
Emp. Form.:
C30H37ClN4O3
Mol. Mass.:
537.093
SMILES:
CC(C)NC(=O)Cn1c(nc2ccc(cc2c1=O)[C@@H]1C[C@H](CN2C[C@H](C)O[C@H](C)C2)C1)-c1cccc(Cl)c1
: