Target
Replicase polyprotein 1ab
Ligand
BDBM11236
Substrate
fluorogenic substrate peptide
Meas. Tech.
SARS-CoV 3CL Protease Inhibition Assay
pH
7±n/a
Temperature
298.15±n/a K
Ki
2290±1010 nM
IC50
5000±n/a nM
Citation
 Shie, JJFang, JMKuo, CJKuo, THLiang, PHHuang, HJYang, WBLin, CHChen, JLWu, YTWong, CH Discovery of potent anilide inhibitors against the severe acute respiratory syndrome 3CL protease. J Med Chem 48:4469-73 (2005)  
Target
Name:
Replicase polyprotein 1ab
Synonyms:
3C-like proteinase 3C-like proteinase (SARS-CoV 3Cpro) 3CLp GFL Guanine-N7 methyltransferase Helicase Leader protein Non-structural protein 10 Non-structural protein 3 Non-structural protein 6 Non-structural protein 8 ORF1ab polyprotein PL2-PRO Pol R1AB_SARS RdRp SARS coronavirus main proteinase nsp1 nsp12 nsp14 nsp16 nsp3 nsp5 nsp7 nsp9 pp1ab | rep
Type:
Protein
Mol. Mass.:
790250.81
Organism:
Human SARS coronavirus (SARS-CoV) (Severe acute respiratory syndrome coronavirus)
Description:
P0C6X7
Residue:
7073
  
Inhibitor
Name:
BDBM11236
Synonyms:
(2S)-N-[(1S)-1-[(2-chloro-4-nitrophenyl)carbamoyl]-2-phenylethyl]-4-methyl-2-[(2S)-3-methyl-2-(thiophen-2-ylformamido)butanamido]pentanamide N-(thien-2-ylcarbonyl)-L-valyl-L-leucyl-N-(2-chloro-4-nitrophenyl)-L-phenylalaninamide
Type:
Small organic molecule
Emp. Form.:
C31H36ClN5O6S
Mol. Mass.:
642.165
SMILES:
CC(C)C[C@H](NC(=O)[C@@H](NC(=O)c1cccs1)C(C)C)C(=O)N[C@@H](Cc1ccccc1)C(=O)Nc1ccc(cc1Cl)[N+]([O-])=O
:
Substrate
Name:
fluorogenic substrate peptide
Synonyms:
Type:
Peptide
Mol. Mass.:
2662.93
Organism:
Description:
Residue:
24