Target
DNA damage-binding protein 1/Protein cereblon
Ligand
BDBM65456
Substrate
Meas. Tech.
TR-FRET cereblon binding assay
pH
7±n/a
IC50
1200±0 nM
Comments
extracted
Citation
 Matyskiela, MEZhang, WMan, HWMuller, GKhambatta, GBaculi, FHickman, MLeBrun, LPagarigan, BCarmel, GLu, CCLu, GRiley, MSatoh, YSchafer, PDaniel, TOCarmichael, JCathers, BEChamberlain, PP A Cereblon Modulator (CC-220) with Improved Degradation of Ikaros and Aiolos. J Med Chem 61:535-542 (2017)  
Target
Name:
DNA damage-binding protein 1/Protein cereblon
Synonyms:
CRBN-DDB1 Cereblon_DDB1 | Protein cereblon/DNA damage-binding protein 1
Type:
Enzyme
Mol. Mass.:
Description:
Components:
This complex has 2 components.
Component 1
Name:
DNA damage-binding protein 1
Synonyms:
DDB p127 subunit DDB1_HUMAN DNA damage-binding protein a HBV X-associated protein 1 UV-damaged DNA-binding factor XAP-1 XPCe XPE-binding factor | Xeroderma pigmentosum group E-complementing protein
Type:
Protein
Mol. Mass.:
126936.22
Organism:
Homo sapiens (Human)
Description:
Q16531
Residue:
1140
  
Component 2
Name:
Protein cereblon
Synonyms:
CRBN | CRBN_HUMAN
Type:
PROTEIN
Mol. Mass.:
50537.73
Organism:
Homo sapiens (Human)
Description:
ChEMBL_116917
Residue:
442
  
Inhibitor
Name:
BDBM65456
Synonyms:
19171-19-8 Actimid Pomalyst US20230271966, Compound Pomalidomide pomalidomide
Type:
Small organic molecule
Emp. Form.:
C13H11N3O4
Mol. Mass.:
273.2441
SMILES:
Nc1cccc2C(=O)N(C3CCC(=O)NC3=O)C(=O)c12
: