Target
Caspase-1
Ligand
BDBM12046
Substrate
Caspase-1 Fluorogenic Substrate
Meas. Tech.
Caspase Inhibition Assay
pH
7±n/a
Temperature
310.15±n/a K
Ki
24000±n/a nM
Citation
 Shahripour, ABPlummer, MSLunney, EAAlbrecht, HPHays, SJKostlan, CRSawyer, TKWalker, NPBrady, KDAllen, HJTalanian, RVWong, WWHumblet, C Structure-based design of nonpeptide inhibitors of interleukin-1beta converting enzyme (ICE, caspase-1). Bioorg Med Chem 10:31-40 (2002)  
Target
Name:
Caspase-1
Synonyms:
CASP1 Caspase ICE IL1BCE Interleukin-1 beta-converting enzyme
Type:
Enzyme
Mol. Mass.:
45154.13
Organism:
Homo sapiens (Human)
Description:
P29466
Residue:
404
  
Inhibitor
Name:
BDBM12046
Synonyms:
(3S)-3-benzenesulfonamido-4-oxo-5-[(3-phenylpropyl)sulfanyl]pentanoic acid arylsulfonamide analogue 10
Type:
Small organic molecule
Emp. Form.:
C20H23NO5S2
Mol. Mass.:
421.53
SMILES:
OC(=O)C[C@H](NS(=O)(=O)c1ccccc1)C(=O)CSCCCc1ccccc1
:
Substrate
Name:
Caspase-1 Fluorogenic Substrate
Synonyms:
Ac-YVAD-AMC
Type:
Mol. Mass.:
1713.07
Organism:
Description:
AMC=7-Amino-4-methylcoumarin
Residue:
17
ACTYRVALALAASPAMC