Target
Caspase-1
Ligand
BDBM12054
Substrate
Caspase-1 Fluorogenic Substrate
Meas. Tech.
Caspase Inhibition Assay
pH
7±n/a
Temperature
310.15±n/a K
Ki
2300±n/a nM
Citation
 Shahripour, ABPlummer, MSLunney, EAAlbrecht, HPHays, SJKostlan, CRSawyer, TKWalker, NPBrady, KDAllen, HJTalanian, RVWong, WWHumblet, C Structure-based design of nonpeptide inhibitors of interleukin-1beta converting enzyme (ICE, caspase-1). Bioorg Med Chem 10:31-40 (2002)  
Target
Name:
Caspase-1
Synonyms:
CASP1 Caspase ICE IL1BCE Interleukin-1 beta-converting enzyme
Type:
Enzyme
Mol. Mass.:
45154.13
Organism:
Homo sapiens (Human)
Description:
P29466
Residue:
404
  
Inhibitor
Name:
BDBM12054
Synonyms:
(3S)-3-{[2-(3-acetamidophenyl)benzene]sulfonamido}-4-oxobutanoic acid arylsulfonamide analogue 18
Type:
Small organic molecule
Emp. Form.:
C18H18N2O6S
Mol. Mass.:
390.41
SMILES:
CC(=O)Nc1cccc(c1)-c1ccccc1S(=O)(=O)N[C@@H](CC(O)=O)C=O
:
Substrate
Name:
Caspase-1 Fluorogenic Substrate
Synonyms:
Ac-YVAD-AMC
Type:
Mol. Mass.:
1713.07
Organism:
Description:
AMC=7-Amino-4-methylcoumarin
Residue:
17
ACTYRVALALAASPAMC