Target
Caspase-1
Ligand
BDBM12056
Substrate
Caspase-1 Fluorogenic Substrate
Meas. Tech.
Caspase Inhibition Assay
pH
7±n/a
Temperature
310.15±n/a K
Ki
2400±n/a nM
Citation
 Shahripour, ABPlummer, MSLunney, EASawyer, TKStankovic, CJConnolly, MKRubin, JRWalker, NPBrady, KDAllen, HJTalanian, RVWong, WWHumblet, C Structure-based design of caspase-1 inhibitor containing a diphenyl ether sulfonamide. Bioorg Med Chem Lett 11:2779-82 (2001)  
Target
Name:
Caspase-1
Synonyms:
CASP1 Caspase ICE IL1BCE Interleukin-1 beta-converting enzyme
Type:
Enzyme
Mol. Mass.:
45154.13
Organism:
Homo sapiens (Human)
Description:
P29466
Residue:
404
  
Inhibitor
Name:
BDBM12056
Synonyms:
(3S)-4-oxo-3-[(2-phenoxybenzene)sulfonamido]butanoic acid | Diphenyl Ether Sulfonamide 2
Type:
Small organic molecule
Emp. Form.:
C16H15NO6S
Mol. Mass.:
349.358
SMILES:
OC(=O)C[C@H](NS(=O)(=O)c1ccccc1Oc1ccccc1)C=O
:
Substrate
Name:
Caspase-1 Fluorogenic Substrate
Synonyms:
Ac-YVAD-AMC
Type:
Mol. Mass.:
1713.07
Organism:
Description:
AMC=7-Amino-4-methylcoumarin
Residue:
17
ACTYRVALALAASPAMC