Target
Non-receptor tyrosine-protein kinase TYK2
Ligand
BDBM332776
Substrate
Meas. Tech.
Tyk2 & JAK2 Caliper Assay
Ki
<10±n/a nM
Citation
 Masse, CEGreenwood, JRRomero, DLHarriman, GCWester, RTShelley, MKennedy-Smith, JJDahlgren, M TYK2 inhibitors and uses thereof US Patent  US10196390 Publication Date 2/5/2019 
Target
Name:
Non-receptor tyrosine-protein kinase TYK2
Synonyms:
Non-receptor tyrosine-protein kinase TYK2 (TYK2) TYK2_HUMAN | Tyrosine-protein kinase TYK2
Type:
Protein
Mol. Mass.:
133666.03
Organism:
Homo sapiens (Human)
Description:
P29597
Residue:
1187
  
Inhibitor
Name:
BDBM332776
Synonyms:
US10196390, Compound I-12
Type:
Small organic molecule
Emp. Form.:
C23H20F2N6O2
Mol. Mass.:
450.4407
SMILES:
Fc1cccc(F)c1-c1nc2CNC(=O)c2c(Nc2ccc(CC(=O)NC3CNC3)cc2)n1
: