Target
Non-receptor tyrosine-protein kinase TYK2
Ligand
BDBM332824
Substrate
Meas. Tech.
Tyk2 & JAK2 Caliper Assay
Ki
<10±n/a nM
Citation
 Masse, CEGreenwood, JRRomero, DLHarriman, GCWester, RTShelley, MKennedy-Smith, JJDahlgren, M TYK2 inhibitors and uses thereof US Patent  US10196390 Publication Date 2/5/2019 
Target
Name:
Non-receptor tyrosine-protein kinase TYK2
Synonyms:
Non-receptor tyrosine-protein kinase TYK2 (TYK2) TYK2_HUMAN | Tyrosine-protein kinase TYK2
Type:
Protein
Mol. Mass.:
133666.03
Organism:
Homo sapiens (Human)
Description:
P29597
Residue:
1187
  
Inhibitor
Name:
BDBM332824
Synonyms:
US10196390, Compound I-114
Type:
Small organic molecule
Emp. Form.:
C22H17ClFN5O2
Mol. Mass.:
437.854
SMILES:
Fc1cccc(Cl)c1-c1nc2CNC(=O)c2c(Nc2ccc(cc2)[C@H]2CCNC2=O)n1
: