Target
Non-receptor tyrosine-protein kinase TYK2
Ligand
BDBM332832
Substrate
Meas. Tech.
Tyk2 & JAK2 Caliper Assay
Ki
<10±n/a nM
Citation
 Masse, CEGreenwood, JRRomero, DLHarriman, GCWester, RTShelley, MKennedy-Smith, JJDahlgren, M TYK2 inhibitors and uses thereof US Patent  US10196390 Publication Date 2/5/2019 
Target
Name:
Non-receptor tyrosine-protein kinase TYK2
Synonyms:
Non-receptor tyrosine-protein kinase TYK2 (TYK2) TYK2_HUMAN | Tyrosine-protein kinase TYK2
Type:
Protein
Mol. Mass.:
133666.03
Organism:
Homo sapiens (Human)
Description:
P29597
Residue:
1187
  
Inhibitor
Name:
BDBM332832
Synonyms:
US10196390, Compound I-122
Type:
Small organic molecule
Emp. Form.:
C28H28F2N6O3
Mol. Mass.:
534.5571
SMILES:
Fc1cccc(F)c1-c1nc2CNC(=O)c2c(Nc2ccc(cc2)[C@H]2CCN(CCN3CCOCC3)C2=O)n1
: