Target
Nuclear receptor subfamily 2 group C member 1
Ligand
BDBM333437
Substrate
Meas. Tech.
Inhibition Assay
IC50
4000±n/a nM
Citation
 Traynelis, SFMullasseril, PGarnier, ECLiotta, DCZimmerman, S NMDA receptor modulators and uses related thereto US Patent  US9737522 Publication Date 8/22/2017 
Target
Name:
Nuclear receptor subfamily 2 group C member 1
Synonyms:
NR2C1_RAT Nuclear receptor subfamily 2 group C member 1 (NR2C) | Tr2
Type:
Protein
Mol. Mass.:
65528.28
Organism:
Rattus norvegicus (Rat)
Description:
Q8VIJ4
Residue:
590
  
Inhibitor
Name:
BDBM333437
Synonyms:
US9737522, Compound 11
Type:
Small organic molecule
Emp. Form.:
C27H22ClN3O3
Mol. Mass.:
471.935
SMILES:
Cc1ccc(cc1)C1N(CCc2c[nH]c3cc(Cl)ccc23)C(=O)C(O)=C1C(=O)c1cccnc1
: