Target
Prostaglandin E2 receptor EP3 subtype
Ligand
BDBM335699
Substrate
Meas. Tech.
Radioligand SPA Binding Assay
Ki
7.20±n/a nM
Citation
 Bahnck, KCanterbury, DEdmonds, DJFutatsugi, KLee, ECMenhaji-Klotz, EPolivkova, JStanton, RV Antagonists of prostaglandin EP3 receptor US Patent  US9738626 Publication Date 8/22/2017 
Target
Name:
Prostaglandin E2 receptor EP3 subtype
Synonyms:
PE2R3_HUMAN PGE2-R Prostaglandin E2 receptor Prostaglandin E2 receptor EP3 subtype (EP3) Prostaglandin E2 receptor EP3D subtype (EP3D) | Prostanoid EP3 receptor
Type:
Enzyme
Mol. Mass.:
43335.03
Organism:
Homo sapiens (Human)
Description:
P43115
Residue:
390
  
Inhibitor
Name:
BDBM335699
Synonyms:
(R)-3-(3-Methyl-2-oxopiperidin-3-yl)-6-(5-methylquinolin-7-yl)pyridin-2(1H)-one | US9738626, 2 (free base and TFA salt)
Type:
Small organic molecule
Emp. Form.:
C21H21N3O2
Mol. Mass.:
347.4103
SMILES:
Cc1cc(cc2ncccc12)-c1ccc(c(=O)[nH]1)[C@@]1(C)CCCNC1=O
: