Target
Prostaglandin E2 receptor EP3 subtype
Ligand
BDBM335704
Substrate
Meas. Tech.
Radioligand SPA Binding Assay
Ki
18.6±n/a nM
Citation
 Bahnck, KCanterbury, DEdmonds, DJFutatsugi, KLee, ECMenhaji-Klotz, EPolivkova, JStanton, RV Antagonists of prostaglandin EP3 receptor US Patent  US9738626 Publication Date 8/22/2017 
Target
Name:
Prostaglandin E2 receptor EP3 subtype
Synonyms:
PE2R3_HUMAN PGE2-R Prostaglandin E2 receptor Prostaglandin E2 receptor EP3 subtype (EP3) Prostaglandin E2 receptor EP3D subtype (EP3D) | Prostanoid EP3 receptor
Type:
Enzyme
Mol. Mass.:
43335.03
Organism:
Homo sapiens (Human)
Description:
P43115
Residue:
390
  
Inhibitor
Name:
BDBM335704
Synonyms:
(R)-3-(3-Methyl-2-oxopyrrolidin-3-yl)-6-(5-methylquinolin-3-yl)pyridin-2(1H)-one | US9738626, 7 (formate salt)
Type:
Small organic molecule
Emp. Form.:
C20H19N3O2
Mol. Mass.:
333.3838
SMILES:
Cc1cccc2ncc(cc12)-c1ccc(c(=O)[nH]1)[C@@]1(C)CCNC1=O
: