Target
Dimer of Gag-Pol polyprotein [501-599,Q508K,L534I,L564I,C568A,C596A,L525I]
Ligand
BDBM13935
Substrate
Chromogenic Substrate
Meas. Tech.
Protease Inhibition Assay
pH
5±n/a
Temperature
295.15±n/a K
Ki
3.5±n/a nM
Km
310000±45000 nM
Comments
kcat/Km=0.19 +/- 0.03 min-1uM-1
Citation
 Liu, FBoross, PIWang, YFTozser, JLouis, JMHarrison, RWWeber, IT Kinetic, stability, and structural changes in high-resolution crystal structures of HIV-1 protease with drug-resistant mutations L24I, I50V, and G73S. J Mol Biol 354:789-800 (2005)  
Target
Name:
Dimer of Gag-Pol polyprotein [501-599,Q508K,L534I,L564I,C568A,C596A,L525I]
Synonyms:
HIV-1 Protease Mutant (L24I)
Type:
Protein Complex
Mol. Mass.:
Description:
The HIV-1 PR DNA for all of wildtype and mutants was cloned, and protein was expressed, purified, and refolded from Escherichia coli strain BL21.
Components:
This complex has 2 components.
Component 1
Name:
Gag-Pol polyprotein [501-599,Q508K,L534I,L564I,C568A,C596A,L525I]
Synonyms:
HIV-1 Protease Mutant (L24I) chain A POL_HV1BR | gag-pol
Type:
Enzyme Subunit
Mol. Mass.:
10732.11
Organism:
Human immunodeficiency virus type 1
Description:
P03367[501-599,Q508K,L534I,L564I,C568A,C596A,L525I]
Residue:
99
  
Component 2
Name:
Gag-Pol polyprotein [501-599,Q508K,L534I,L564I,C568A,C596A,L525I]
Synonyms:
HIV-1 Protease Mutant (L24I) chain A POL_HV1BR | gag-pol
Type:
Enzyme Subunit
Mol. Mass.:
10732.11
Organism:
Human immunodeficiency virus type 1
Description:
P03367[501-599,Q508K,L534I,L564I,C568A,C596A,L525I]
Residue:
99
  
Inhibitor
Name:
BDBM13935
Synonyms:
(4S)-4-[(2S)-2-{[(2S)-2-[(2S)-2-[(2S)-2-amino-5-carbamimidamidopentanamido]-3-methylbutanamido]-4-methylpentyl]amino}-3-phenylpropanamido]-4-{[(1S)-1-{[(1S)-1-carbamoylpentyl]carbamoyl}ethyl]carbamoyl}butanoic acid N-1270 R-V-L-r-F-E-A-Nle
Type:
7-mer
Emp. Form.:
C40H69N11O8
Mol. Mass.:
832.0448
SMILES:
CCCC[C@H](NC(=O)[C@H](C)NC(=O)[C@H](CCC(O)=O)NC(=O)[C@H](Cc1ccccc1)NC[C@H](CC(C)C)NC(=O)[C@@H](NC(=O)[C@@H](N)CCCNC(N)=N)C(C)C)C(N)=O
:
Substrate
Name:
Chromogenic Substrate
Synonyms:
CA/p2#
Type:
Peptide
Mol. Mass.:
2887.67
Organism:
Description:
Residue:
25