Target
Prothrombin
Ligand
BDBM13940
Substrate
BDBM12679
Meas. Tech.
Enzyme Assay and Determination of the Inhibition Constants
Ki
8±n/a nM
Citation
 Katz, BAElrod, KLuong, CRice, MJMackman, RLSprengeler, PASpencer, JHataye, JJanc, JLink, JLitvak, JRai, RRice, KSideris, SVerner, EYoung, W A novel serine protease inhibition motif involving a multi-centered short hydrogen bonding network at the active site. J Mol Biol 307:1451-86 (2001)  
Target
Name:
Prothrombin
Synonyms:
Activation peptide fragment 1 Coagulation factor II Prothrombin precursor Thrombin heavy chain | Thrombin light chain
Type:
Protein
Mol. Mass.:
70029.57
Organism:
Homo sapiens (Human)
Description:
P00734
Residue:
622
  
Inhibitor
Name:
BDBM13940
Synonyms:
2-(3-HYDROXY-PYRIDIN-2-YL)-1H-BENZOIMIDAZOLE-5-CARBOXAMIDINE {amino[2-(3-hydroxypyridin-2-yl)-1H-1,3-benzodiazol-5-yl]methylidene}azanium
Type:
Small organic molecule
Emp. Form.:
C13H12N5O
Mol. Mass.:
254.2667
SMILES:
NC(=[NH2+])c1ccc2nc([nH]c2c1)-c1ncccc1O
:
Substrate
Name:
BDBM12679
Synonyms:
BDBM13790 Chromogenic Substrate
Type:
Small organic molecule
Emp. Form.:
C26H34N6O7S
Mol. Mass.:
574.649
SMILES:
Cc1ccc(cc1)S(=O)(=O)NCC(=O)N1CCCC1C(=O)NC(CCCCN)C(=O)Nc1ccc(cc1)[N+]([O-])=O
: