Target
Tyrosine-protein phosphatase non-receptor type 1 [1-298]
Ligand
BDBM13990
Substrate
BDBM13466
Meas. Tech.
PTP1B and TCPTP Inhibition Assay
pH
7.5±n/a
Temperature
295.15±n/a K
Ki
6900±n/a nM
Citation
 Zhao, HLiu, GXin, ZSerby, MDPei, ZSzczepankiewicz, BGHajduk, PJAbad-Zapatero, CHutchins, CWLubben, THBallaron, SJHaasch, DLKaszubska, WRondinone, CMTrevillyan, JMJirousek, MR Isoxazole carboxylic acids as protein tyrosine phosphatase 1B (PTP1B) inhibitors. Bioorg Med Chem Lett 14:5543-6 (2004)  
Target
Name:
Tyrosine-protein phosphatase non-receptor type 1 [1-298]
Synonyms:
PTN1_HUMAN PTP1B PTPase 1B Tyrosine-protein phosphatase, non-receptor type 1
Type:
Enzyme
Mol. Mass.:
34670.65
Organism:
Homo sapiens (Human)
Description:
The catalytic domain of PTP 1B (residues 1-298) was expressed and purified from E. coli.
Residue:
298
  
Inhibitor
Name:
BDBM13990
Synonyms:
5-{2-fluoro-5-[(1E)-3-[3-hydroxy-2-(methoxycarbonyl)phenoxy]prop-1-en-1-yl]phenyl}-1,2-oxazole-3-carboxylic acid Isoxazole carboxylic acid analog 1
Type:
Small organic molecule
Emp. Form.:
C21H16FNO7
Mol. Mass.:
413.3526
SMILES:
COC(=O)c1c(O)cccc1OC\C=C\c1ccc(F)c(c1)-c1cc(no1)C(O)=O
:
Substrate
Name:
BDBM13466
Synonyms:
4-Nitrophenyl phosphate disodium salt hexahydrate disodium (4-nitrophenyl) phosphate | para-nitrophenyl phosphate (pNPP)
Type:
Small organic molecule
Emp. Form.:
C6H4NO6P
Mol. Mass.:
217.0739
SMILES:
[O-][N+](=O)c1ccc(O[P+]([O-])([O-])[O-])cc1
: