Target
Phosphatidylinositol 4,5-bisphosphate 3-kinase catalytic subunit delta isoform
Ligand
BDBM203415
Substrate
Meas. Tech.
Inhibition Assay
Temperature
298.15±n/a K
IC50
5.50±n/a nM
Comments
extracted
Citation
 Caravatti, GChamoin, SFuret, PHogenauer, KHurth, KKammertoens, KLewis, IMoebitz, HSmith, ABSoldermann, NWolf, RZecri, F Dihydro-benzo-oxazine and dihydro-pyrido-oxazine derivatives US Patent  US9539260 Publication Date 1/10/2017 
Target
Name:
Phosphatidylinositol 4,5-bisphosphate 3-kinase catalytic subunit delta isoform
Synonyms:
PI3-kinase p110 subunit delta PI3-kinase subunit p110-delta PIK3CD Phosphatidylinositol 4,5-biphosphate 3-kinase catalytic subunit delta (PIK3CD) Phosphatidylinositol 4,5-bisphosphate 3-kinase 110 kDa catalytic subunit delta (PI3K delta) Phosphatidylinositol 4,5-bisphosphate 3-kinase catalytic subunit delta (PI3Kdelta) Phosphatidylinositol 4,5-bisphosphate 3-kinase catalytic subunit delta isoform (PI3K delta) Phosphatidylinositol 4,5-bisphosphate 3-kinase catalytic subunit delta isoform (PI3K-delta) Phosphatidylinositol 4,5-bisphosphate 3-kinase catalytic subunit delta isoform (PI3Kdelta)
Type:
Enzyme Subunit
Mol. Mass.:
119489.41
Organism:
Homo sapiens (Human)
Description:
O00329
Residue:
1044
  
Inhibitor
Name:
BDBM203415
Synonyms:
US9539260, B71 | US9763952, Example B71
Type:
Small organic molecule
Emp. Form.:
C25H30FN3O6S
Mol. Mass.:
519.586
SMILES:
CS(=O)(=O)c1ncc(cc1CF)N1CCOc2ccc(O[C@H]3CCN(C3)C(=O)C3CCOCC3)cc12
: