Target
Phosphatidylinositol 4,5-bisphosphate 3-kinase catalytic subunit alpha isoform
Ligand
BDBM204008
Substrate
Meas. Tech.
Inhibition Assay
Temperature
298.15±n/a K
IC50
142±n/a nM
Comments
extracted
Citation
 Caravatti, GChamoin, SFuret, PHogenauer, KHurth, KKammertoens, KLewis, IMoebitz, HSmith, ABSoldermann, NWolf, RZecri, F Dihydro-benzo-oxazine and dihydro-pyrido-oxazine derivatives US Patent  US9539260 Publication Date 1/10/2017 
Target
Name:
Phosphatidylinositol 4,5-bisphosphate 3-kinase catalytic subunit alpha isoform
Synonyms:
P42336 PI3-kinase subunit p110-alpha PIK3CA Phosphatidylinositol 3-kinase alpha (PI3Kalpha) Phosphatidylinositol 4,5-bisphosphate 3-kinase (PI3K) Phosphatidylinositol 4,5-bisphosphate 3-kinase catalytic subunit alpha (PI3Kalpha) Phosphatidylinositol 4,5-bisphosphate 3-kinase catalytic subunit alpha isoform (PI3-Ka) Phosphatidylinositol 4,5-bisphosphate 3-kinase catalytic subunit alpha isoform (PI3K p110alpha) Phosphatidylinositol 4,5-bisphosphate 3-kinase catalytic subunit alpha isoform (PI3K-alpha) Phosphatidylinositol 4,5-bisphosphate 3-kinase catalytic subunit alpha isoform (PI3Kalpha p110alpha) Phosphatidylinositol 4,5-bisphosphate 3-kinase catalytic subunit alpha isoform (PIK3CA) Phosphatidylinositol-4,5-bisphosphate 3-kinase catalytic subunit alpha isoform Phosphoinositide 3-Kinase (PI3K), alpha Chain A Phosphoinositide 3-kinases (PI3K) PtdIns-3-kinase p110 | p110 alpha
Type:
Enzyme Subunit
Mol. Mass.:
124294.87
Organism:
Homo sapiens (Human)
Description:
P42336
Residue:
1068
  
Inhibitor
Name:
BDBM204008
Synonyms:
US9539260, D12 | US9763952, Example D12
Type:
Small organic molecule
Emp. Form.:
C22H24N4O5
Mol. Mass.:
424.4498
SMILES:
COCC(=O)N1CC[C@@H](C1)Oc1ccc2OCCN(c3cnc(OC)c(c3)C#N)c2c1
: