Target
Diacylglycerol O-acyltransferase 2
Ligand
BDBM323601
Substrate
Meas. Tech.
In Vitro DGAT2 Assay
IC50
149±n/a nM
Citation
 Futatsugi, K Diacylglycerol acyltransferase 2 inhibitors US Patent  US9789110 Publication Date 10/17/2017 
Target
Name:
Diacylglycerol O-acyltransferase 2
Synonyms:
ARAT DGAT2 Diacylglycerol O-acyltransferase 2 (DGAT2) Retinol O-fatty-acyltransferase
Type:
Multi-pass membrane protein
Mol. Mass.:
43848.90
Organism:
Homo sapiens (Human)
Description:
Q96PD7
Residue:
388
  
Inhibitor
Name:
BDBM323601
Synonyms:
US10188653, Example 7 | US9789110, 7
Type:
Small organic molecule
Emp. Form.:
C27H29N3O5
Mol. Mass.:
475.5363
SMILES:
CCOc1ccccc1O[C@@H]1CCCN(C1)c1ccc(cn1)C(=O)NCc1cccc(c1)C(O)=O
: