Target
Diacylglycerol O-acyltransferase 2
Ligand
BDBM323602
Substrate
Meas. Tech.
In Vitro DGAT2 Assay
IC50
9.70±n/a nM
Citation
 Futatsugi, K Diacylglycerol acyltransferase 2 inhibitors US Patent  US9789110 Publication Date 10/17/2017 
Target
Name:
Diacylglycerol O-acyltransferase 2
Synonyms:
ARAT DGAT2 Diacylglycerol O-acyltransferase 2 (DGAT2) Retinol O-fatty-acyltransferase
Type:
Multi-pass membrane protein
Mol. Mass.:
43848.90
Organism:
Homo sapiens (Human)
Description:
Q96PD7
Residue:
388
  
Inhibitor
Name:
BDBM323602
Synonyms:
US10188653, Example 8 | US9789110, 8
Type:
Small organic molecule
Emp. Form.:
C26H27FN4O5
Mol. Mass.:
494.5148
SMILES:
CCOc1ccccc1O[C@@H]1CCCN(C1)c1ncc(cc1F)C(=O)NCc1ccnc(c1)C(O)=O
: