Target
Diacylglycerol O-acyltransferase 2
Ligand
BDBM323612
Substrate
Meas. Tech.
In Vitro DGAT2 Assay
IC50
38.1±n/a nM
Citation
 Futatsugi, K Diacylglycerol acyltransferase 2 inhibitors US Patent  US9789110 Publication Date 10/17/2017 
Target
Name:
Diacylglycerol O-acyltransferase 2
Synonyms:
ARAT DGAT2 Diacylglycerol O-acyltransferase 2 (DGAT2) Retinol O-fatty-acyltransferase
Type:
Multi-pass membrane protein
Mol. Mass.:
43848.90
Organism:
Homo sapiens (Human)
Description:
Q96PD7
Residue:
388
  
Inhibitor
Name:
BDBM323612
Synonyms:
US10188653, Example 9 | US9789110, 9
Type:
Small organic molecule
Emp. Form.:
C27H30N4O5
Mol. Mass.:
490.5509
SMILES:
CCOc1ccccc1O[C@@H]1CCCN(C1)c1ncc(cn1)C(=O)NCc1cc(ccc1C)C(O)=O
: