Target
Diacylglycerol O-acyltransferase 2
Ligand
BDBM323636
Substrate
Meas. Tech.
In Vitro DGAT2 Assay
IC50
124±n/a nM
Citation
 Futatsugi, K Diacylglycerol acyltransferase 2 inhibitors US Patent  US9789110 Publication Date 10/17/2017 
Target
Name:
Diacylglycerol O-acyltransferase 2
Synonyms:
ARAT DGAT2 Diacylglycerol O-acyltransferase 2 (DGAT2) Retinol O-fatty-acyltransferase
Type:
Multi-pass membrane protein
Mol. Mass.:
43848.90
Organism:
Homo sapiens (Human)
Description:
Q96PD7
Residue:
388
  
Inhibitor
Name:
BDBM323636
Synonyms:
(R)-N-(2-amino-2- iminoethyl)-2-(3-(2- ethoxyphenoxy)piperidin- 1-yl)pyrimidine-5- carboxamide US9789110, 19.5
Type:
Small organic molecule
Emp. Form.:
C20H26N6O3
Mol. Mass.:
398.4588
SMILES:
CCOc1ccccc1O[C@@H]1CCCN(C1)c1ncc(cn1)C(=O)NCC(N)=N
: