Target
Diacylglycerol O-acyltransferase 2
Ligand
BDBM347385
Substrate
Meas. Tech.
In Vitro DGAT2 Assay
IC50
102±n/a nM
Citation
 Futatsugi, K Diacylglycerol acyltransferase 2 inhibitors US Patent  US9789110 Publication Date 10/17/2017 
Target
Name:
Diacylglycerol O-acyltransferase 2
Synonyms:
ARAT DGAT2 Diacylglycerol O-acyltransferase 2 (DGAT2) Retinol O-fatty-acyltransferase
Type:
Multi-pass membrane protein
Mol. Mass.:
43848.90
Organism:
Homo sapiens (Human)
Description:
Q96PD7
Residue:
388
  
Inhibitor
Name:
BDBM347385
Synonyms:
(R)-2-(3-(2- ethoxyphenoxy)piperidin- 1-yl)-N-(2- (methylsulfonyl)ethyl) pyrimidine-5-carboxamide | US9789110, 19.8
Type:
Small organic molecule
Emp. Form.:
C21H28N4O5S
Mol. Mass.:
448.536
SMILES:
CCOc1ccccc1OC1CCCN(C1)[C@@H](CNC(=O)c1cncnc1)S(C)(=O)=O
: