Target
Diacylglycerol O-acyltransferase 2
Ligand
BDBM323645
Substrate
Meas. Tech.
In Vitro DGAT2 Assay
IC50
46.7±n/a nM
Citation
 Futatsugi, K Diacylglycerol acyltransferase 2 inhibitors US Patent  US9789110 Publication Date 10/17/2017 
Target
Name:
Diacylglycerol O-acyltransferase 2
Synonyms:
ARAT DGAT2 Diacylglycerol O-acyltransferase 2 (DGAT2) Retinol O-fatty-acyltransferase
Type:
Multi-pass membrane protein
Mol. Mass.:
43848.90
Organism:
Homo sapiens (Human)
Description:
Q96PD7
Residue:
388
  
Inhibitor
Name:
BDBM323645
Synonyms:
2-((R)-3-(2-ethoxy- phenoxy)piperidin-1-yl)- N-((R)-5-oxopyrrolidin- 3-yl)pyrimidine-5- carboxamide US9789110, 19.13
Type:
Small organic molecule
Emp. Form.:
C22H27N5O4
Mol. Mass.:
425.4809
SMILES:
CCOc1ccccc1O[C@@H]1CCCN(C1)c1ncc(cn1)C(=O)N[C@H]1CNC(=O)C1
: