Target
Diacylglycerol O-acyltransferase 2
Ligand
BDBM323649
Substrate
Meas. Tech.
In Vitro DGAT2 Assay
IC50
12.2±n/a nM
Citation
 Futatsugi, K Diacylglycerol acyltransferase 2 inhibitors US Patent  US9789110 Publication Date 10/17/2017 
Target
Name:
Diacylglycerol O-acyltransferase 2
Synonyms:
ARAT DGAT2 Diacylglycerol O-acyltransferase 2 (DGAT2) Retinol O-fatty-acyltransferase
Type:
Multi-pass membrane protein
Mol. Mass.:
43848.90
Organism:
Homo sapiens (Human)
Description:
Q96PD7
Residue:
388
  
Inhibitor
Name:
BDBM323649
Synonyms:
(R)-N-(4-amino-2-methyl- 4-oxobutan-2-yl)-2-(3-(2- ethoxyphenoxy)piperidin- 1-yl)pyrimidine-5- carboxamide US9789110, 19.17
Type:
Small organic molecule
Emp. Form.:
C23H31N5O4
Mol. Mass.:
441.5233
SMILES:
CCOc1ccccc1O[C@@H]1CCCN(C1)c1ncc(cn1)C(=O)NC(C)(C)CC(N)=O
: