Target
Diacylglycerol O-acyltransferase 2
Ligand
BDBM323660
Substrate
Meas. Tech.
In Vitro DGAT2 Assay
IC50
68.0±n/a nM
Citation
 Futatsugi, K Diacylglycerol acyltransferase 2 inhibitors US Patent  US9789110 Publication Date 10/17/2017 
Target
Name:
Diacylglycerol O-acyltransferase 2
Synonyms:
ARAT DGAT2 Diacylglycerol O-acyltransferase 2 (DGAT2) Retinol O-fatty-acyltransferase
Type:
Multi-pass membrane protein
Mol. Mass.:
43848.90
Organism:
Homo sapiens (Human)
Description:
Q96PD7
Residue:
388
  
Inhibitor
Name:
BDBM323660
Synonyms:
(R)-2-(3-(2-ethoxy- phenoxy)piperidin-1-yl)- N-((5-oxo-2,5-dihydro- 1H-1,2,4-triazol-3- yl)methyl)pyrimidine-5- carboxamide US9789110, 20.5
Type:
Small organic molecule
Emp. Form.:
C21H25N7O4
Mol. Mass.:
439.4677
SMILES:
CCOc1ccccc1O[C@@H]1CCCN(C1)c1ncc(cn1)C(=O)NCc1nc(=O)[nH][nH]1
: