Target
Diacylglycerol O-acyltransferase 2
Ligand
BDBM323662
Substrate
Meas. Tech.
In Vitro DGAT2 Assay
IC50
7.90±n/a nM
Citation
 Futatsugi, K Diacylglycerol acyltransferase 2 inhibitors US Patent  US9789110 Publication Date 10/17/2017 
Target
Name:
Diacylglycerol O-acyltransferase 2
Synonyms:
ARAT DGAT2 Diacylglycerol O-acyltransferase 2 (DGAT2) Retinol O-fatty-acyltransferase
Type:
Multi-pass membrane protein
Mol. Mass.:
43848.90
Organism:
Homo sapiens (Human)
Description:
Q96PD7
Residue:
388
  
Inhibitor
Name:
BDBM323662
Synonyms:
(R)-(3,3-difluoroazetidin- 1-yl)(2-(3-(2- ethoxyphenoxy)piperidin- 1-yl)pyrimidin-5- yl)methanone US9789110, 20.7
Type:
Small organic molecule
Emp. Form.:
C21H24F2N4O3
Mol. Mass.:
418.4371
SMILES:
CCOc1ccccc1O[C@@H]1CCCN(C1)c1ncc(cn1)C(=O)N1CC(F)(F)C1
: