Target
ATP-dependent molecular chaperone HSP82
Ligand
BDBM15379
Substrate
BDBM2
Meas. Tech.
Colorimetric Determination of ATPase Activity
pH
7.4±n/a
Temperature
310.15±n/a K
IC50
>200000±n/a nM
Citation
 Wright, LBarril, XDymock, BSheridan, LSurgenor, ABeswick, MDrysdale, MCollier, AMassey, ADavies, NFink, AFromont, CAherne, WBoxall, KSharp, SWorkman, PHubbard, RE Structure-activity relationships in purine-based inhibitor binding to HSP90 isoforms. Chem Biol 11:775-85 (2004)  
Target
Name:
ATP-dependent molecular chaperone HSP82
Synonyms:
82 kDa heat shock protein HSP82 HSP90 Heat shock protein Hsp90 heat-inducible isoform
Type:
Molecular Chaperone
Mol. Mass.:
81369.08
Organism:
Saccharomyces cerevisiae
Description:
Histidine-tagged yeast HSP90 was transformed into E. coli and purified (>90%) by metal affinity, gel filtration, and ion-exchange chromatography.
Residue:
709
  
Inhibitor
Name:
BDBM15379
Synonyms:
9-butyl-8-(2-chloro-3,4,5-trimethoxybenzyl)-9H-purin-6-amine CHEMBL112896 Purine-Based Inhibitor 6
Type:
Small organic molecule
Emp. Form.:
C19H24ClN5O3
Mol. Mass.:
405.879
SMILES:
CCCCn1c(Cc2cc(OC)c(OC)c(OC)c2Cl)nc2c(N)ncnc12
:
Substrate
Name:
BDBM2
Synonyms:
({[({[(2R,3S,4R,5R)-5-(6-amino-9H-purin-9-yl)-3,4-dihydroxyoxolan-2-yl]methoxy}(hydroxy)phosphoryl)oxy](hydroxy)phosphoryl}oxy)phosphonic acid Brimonidine ATP | CHEMBL14249
Type:
Nucleoside or nucleotide
Emp. Form.:
C10H16N5O13P3
Mol. Mass.:
507.181
SMILES:
Nc1ncnc2n(cnc12)[C@@H]1O[C@H](COP(O)(=O)OP(O)(=O)OP(O)(O)=O)[C@@H](O)[C@H]1O
: