Target
High affinity nerve growth factor receptor
Ligand
BDBM356055
Substrate
Meas. Tech.
Functional Activity Assay
IC50
14.0±n/a nM
Citation
 Mitchell, HFraley, MECooke, AJStump, CAChen, YZhang, XMcComas, CCSchirripa, KMcWherter, MMercer, SPBabaoglu, KMeng, DWu, JLiu, PWood, HBBao, JLi, CSMao, QQi, Z TrkA kinase inhibitors, compositions and methods thereof US Patent  US9815846 Publication Date 11/14/2017 
Target
Name:
High affinity nerve growth factor receptor
Synonyms:
2.7.10.1 NTRK1 NTRK1_HUMAN Neurotrophic tyrosine kinase receptor type 1 Synonyms=MTC TRK1-transforming tyrosine kinase protein TRKA GN Trk-A Tropomyosin-related kinase A Tyrosine kinase receptor Tyrosine kinase receptor A Tyrosine kinase receptor A (Trk-A) gp140trk | p140-TrkA
Type:
Mol. Mass.:
87498.18
Organism:
Homo sapiens (Human)
Description:
P04629
Residue:
796
  
Inhibitor
Name:
BDBM356055
Synonyms:
N-(6-((2- hydroxyacetamido)methyl)-4- phenylpyridin-3-yl)-3-(1- methyl-1H-pyrazol-3-yl)-4- (trifluoromethyl)benzamide | US9815846, Compound 55
Type:
Small organic molecule
Emp. Form.:
C26H22F3N5O3
Mol. Mass.:
509.4798
SMILES:
Cn1ccc(n1)-c1cc(ccc1C(F)(F)F)C(=O)Nc1cnc(CNC(=O)CO)cc1-c1ccccc1
: