Target
Angiopoietin-1 receptor
Ligand
BDBM17796
Substrate
biotinylated Tie-2 peptide substrate
Meas. Tech.
Homogeneous Time-Resolved Fluorescence (HTRF) Enzyme Assay
pH
7.4±n/a
Temperature
295.15±n/a K
IC50
58±n/a nM
Citation
 Hasegawa, MNishigaki, NWashio, YKano, KHarris, PASato, HMori, IWest, RIShibahara, MToyoda, HWang, LNolte, RTVeal, JMCheung, M Discovery of Novel Benzimidazoles as Potent Inhibitors of TIE-2 and VEGFR-2 Tyrosine Kinase Receptors. J Med Chem 50:4453-70 (2007)  
Target
Name:
Angiopoietin-1 receptor
Synonyms:
TEK TIE2_HUMAN Tyrosine-protein kinase receptor (TIE-2) Tyrosine-protein kinase receptor TEK (p140 TEK) Tyrosine-protein kinase receptor TIE2/TEK VMCM1 p140 TEK
Type:
Enzyme
Mol. Mass.:
125835.70
Organism:
Homo sapiens (Human)
Description:
Q02763
Residue:
1124
  
Inhibitor
Name:
BDBM17796
Synonyms:
benzimidazole-urea, 24 | methyl N-{6-[4-({[3-(methylsulfanyl)phenyl]carbamoyl}amino)phenoxy]-1H-1,3-benzodiazol-2-yl}carbamate
Type:
Small organic molecule
Emp. Form.:
C23H21N5O4S
Mol. Mass.:
463.509
SMILES:
COC(=O)Nc1nc2ccc(Oc3ccc(NC(=O)Nc4cccc(SC)c4)cc3)cc2[nH]1
:
Substrate
Name:
biotinylated Tie-2 peptide substrate
Synonyms:
Type:
Peptide
Mol. Mass.:
3022.54
Organism:
Description:
Residue:
27