Target
Vascular endothelial growth factor receptor 2
Ligand
BDBM17795
Substrate
biotinylated VEGFR peptide substrate
Meas. Tech.
Homogeneous Time-Resolved Fluorescence (HTRF) Enzyme Assay
IC50
1.3±n/a nM
Citation
 Hasegawa, MNishigaki, NWashio, YKano, KHarris, PASato, HMori, IWest, RIShibahara, MToyoda, HWang, LNolte, RTVeal, JMCheung, M Discovery of Novel Benzimidazoles as Potent Inhibitors of TIE-2 and VEGFR-2 Tyrosine Kinase Receptors. J Med Chem 50:4453-70 (2007)  
Target
Name:
Vascular endothelial growth factor receptor 2
Synonyms:
CD_antigen=CD309 Fetal liver kinase 1 (FLK-1) KDR Protein-tyrosine kinase receptor Flk-1 VEGFR-2 VEGFR2 Vascular Endothelial Growth Factor Receptor Kinase 2 Vascular endothelial growth factor receptor 2 (KDR) Vascular endothelial growth factor receptor 2 (VEGFR2) Vascular endothelial growth factor receptor-2 (VEGFR-2)
Type:
Receptor Tyrosine Kinase
Mol. Mass.:
151510.97
Organism:
Homo sapiens (Human)
Description:
P35968
Residue:
1356
  
Inhibitor
Name:
BDBM17795
Synonyms:
benzimidazole-urea, 23 | methyl N-(6-{4-[({3-[(trifluoromethyl)sulfanyl]phenyl}carbamoyl)amino]phenoxy}-1H-1,3-benzodiazol-2-yl)carbamate
Type:
Small organic molecule
Emp. Form.:
C23H18F3N5O4S
Mol. Mass.:
517.48
SMILES:
COC(=O)Nc1nc2ccc(Oc3ccc(NC(=O)Nc4cccc(SC(F)(F)F)c4)cc3)cc2[nH]1
:
Substrate
Name:
biotinylated VEGFR peptide substrate
Synonyms:
Type:
Peptide
Mol. Mass.:
3433.86
Organism:
Description:
Residue:
28