Target
Cytochrome P450 2C19
Ligand
BDBM198660
Substrate
IC50
91000±n/a nM
Citation
 Hoekstra, WJRafferty, SWYates, CMSchotzinger, RJLoso, MRSullenberger, MT Metalloenzyme inhibitor compounds US Patent  US9556143 Publication Date 1/31/2017 
Target
Name:
Cytochrome P450 2C19
Synonyms:
(R)-limonene 6-monooxygenase (S)-limonene 7-monooxygenase CYP2C19 CYPIIC19 Cytochrome P450 2C19 [I331V] Cytochrome P450-254C Mephenytoin 4-hydroxylase P450-254C
Type:
Enzyme
Mol. Mass.:
55935.47
Organism:
Homo sapiens (Human)
Description:
P33261
Residue:
490
  
Inhibitor
Name:
BDBM198660
Synonyms:
US9221791, 6 | US9556143, 6
Type:
Small organic molecule
Emp. Form.:
C20H16F7N5O2
Mol. Mass.:
491.3622
SMILES:
OC(Cn1cnnn1)(c1ccc(F)cc1F)C(F)(F)c1ccc(\C=C\COCC(F)(F)F)cn1
: